{"text_format":"1","workbook":"xlsx","n_sheets":6,"sheets":["CC Expense Form Pg 1","CC Expense Form Pg 2","CC Expense Form Pg 3","Expense Code Definitions","JE - TUF USE ONLY","TABLES - TUF USE ONLY"],"not_rendered":{"charts":0,"images":1,"macros":0,"external_links":0,"defined_names":0,"comments":0,"pivot_tables":0},"unopened":[],"bounds":{"document_bytes":16777216,"sheet_cells":100000,"rows_first":2000,"rows_last":500,"rows_between":2000,"halvings":0,"cell_chars":16384,"cell_head_chars":4096},"cells_cut":0,"cells_raw":0,"read":"whole","date_system":"1900"}

{"sheet":"CC Expense Form Pg 1","index":0,"n_rows":42,"n_cols":11,"rows_kept":42,"cut":false,"hidden":false,"merged":[[41,1,41,5],[40,1,40,7],[25,7,25,8],[26,1,26,3],[27,1,27,3],[29,1,29,3],[4,7,4,8],[12,1,12,2]]}
[null,null,null,null,null,"Revised 3/29/22"]
[]
[null,"Capital One Credit Card Expense Allocation Form (Page 1)"]
[]
[null,"REQUIRED FIELDS:"]
[null,"Credit Card Statement Date ==>",null,null,null,null,null,"<== Enter the date of the CC Statement you are submitting"]
[null,"Cardholder Name ==>",null,null,null,null,null,"<== Name (ex. John Mease)"]
[null,"Cardholder Initials ==>",null,null,null,null,null,"<== Initials (ex. JJM)"]
[]
[]
[null,"Attach original invoices, receipts and/or other documentation to support the expenditure"]
[null,"Remit one copy of this Form with your original paperwork and send a second copy electronically to TUFCORPCARD@TOWSON.EDU"]
[null," \n(Choose from the drop-down menu in cells below.\nSee Blue Tab for Expense Code Definitions.)    Expense Code",null,"Date","DR"," Amount $$",null,"(Please be detailed - Your response is what will be reflected back to you on your reports) \nDescription of Expenditure"," TUF\nProject #","TUF Project Name","Mandatory\nChoose \"Yes\" or \"No\" from drop-down menu below.\nFundraising\nExpense?"]
[1,null,"q",{"$f":"IF(F14<>0,$F$6,\"\")","v":""},{"$f":"IF(F14>0,\"D\",IF(F14<0,\"C\",\"\"))","v":""}]
[2,null,"q","",{"$f":"IF(F15>0,\"D\",IF(F15<0,\"C\",\"\"))","v":""}]
{"$rows_left_out":28}
{"sheet":"CC Expense Form Pg 2","index":1,"n_rows":23,"n_cols":11,"rows_kept":23,"cut":false,"hidden":false,"merged":[[4,7,4,8],[12,1,12,2]]}
[null,null,null,null,null,{"$f":"+'CC Expense Form Pg 1'!F1","v":"Revised 3/29/22"}]
[]
[null,"Capital One Credit Card Expense Allocation Form (Page 2)"]
[]
[null,"REQUIRED FIELDS:"]
[null,"Credit Card Statement Date ==>",null,null,null,{"$f":"IF('CC Expense Form Pg 1'!F6>0,'CC Expense Form Pg 1'!F6,\"\")","v":""}]
[null,"Cardholder Name ==>",null,null,null,{"$f":"+'CC Expense Form Pg 1'!F7","v":0}]
[null,"Cardholder Initials ==>",null,null,null,{"$f":"+'CC Expense Form Pg 1'!F8","v":0}]
[]
[]
[null,"Attach original invoices, receipts and/or other documentation to support the expenditure"]
[null,"Remit one copy of this Form with your original paperwork and send a second copy electronically to TUFCORPCARD@TOWSON.EDU"]
[null," \n(Choose from the drop-down menu in cells below.\nSee Blue Tab for Expense Code Definitions.)    Expense Code",null,"Date","DR"," Amount $$",null,"(Please be detailed - Your response is what will be reflected back to you on your reports) \nDescription of Expenditure"," TUF\nProject #","TUF Project Name","Mandatory\nChoose \"Yes\" or \"No\" from drop-down menu below.\nFundraising\nExpense?"]
[11,null,"q",{"$f":"IF(F14<>0,$F$6,\"\")","v":""},{"$f":"IF(F14>0,\"D\",IF(F14<0,\"C\",\"\"))","v":""}]
[12,null,"q",{"$f":"IF(F15<>0,$F$6,\"\")","v":""},{"$f":"IF(F15>0,\"D\",IF(F15<0,\"C\",\"\"))","v":""}]
{"$rows_left_out":9}
{"sheet":"CC Expense Form Pg 3","index":2,"n_rows":26,"n_cols":11,"rows_kept":26,"cut":false,"hidden":false,"merged":[[4,7,4,8],[12,1,12,2]]}
[null,null,null,null,null,{"$f":"+'CC Expense Form Pg 1'!F1","v":"Revised 3/29/22"}]
[]
[null,"Capital One Credit Card Expense Allocation Form (Page 3)"]
[]
[null,"REQUIRED FIELDS:"]
[null,"Credit Card Statement Date ==>",null,null,null,{"$f":"IF('CC Expense Form Pg 1'!F6>0,'CC Expense Form Pg 1'!F6,\"\")","v":""}]
[null,"Cardholder Name ==>",null,null,null,{"$f":"+'CC Expense Form Pg 1'!F7","v":0}]
[null,"Cardholder Initials ==>",null,null,null,{"$f":"+'CC Expense Form Pg 1'!F8","v":0}]
[]
[]
[null,"Attach original invoices, receipts and/or other documentation to support the expenditure"]
[null,"Remit one copy of this Form with your original paperwork and send a second copy electronically to TUFCORPCARD@TOWSON.EDU"]
[null," \n(Choose from the drop-down menu in cells below.\nSee Blue Tab for Expense Code Definitions.)    Expense Code",null,"Date","DR"," Amount $$",null,"(Please be detailed - Your response is what will be reflected back to you on your reports) \nDescription of Expenditure"," TUF\nProject #","TUF Project Name","Mandatory\nChoose \"Yes\" or \"No\" from drop-down menu below.\nFundraising\nExpense?"]
[21,null,"q",{"$f":"IF(F14<>0,$F$6,\"\")","v":""},{"$f":"IF(F14>0,\"D\",IF(F14<0,\"C\",\"\"))","v":""}]
[22,null,"q",{"$f":"IF(F15<>0,$F$6,\"\")","v":""},{"$f":"IF(F15>0,\"D\",IF(F15<0,\"C\",\"\"))","v":""}]
{"$rows_left_out":12}
{"sheet":"Expense Code Definitions","index":3,"n_rows":46,"n_cols":2,"rows_kept":46,"cut":false,"hidden":false,"merged":[]}
["EXPENSE CODE DEFINITIONS"]
[1402,"ACCOUNTS RECEIVABLE – Expenditures that you expect an outside party to reimburse the TU Foundation for"]
[1410,"ADVANCE DEPOSITS - Use this code for expenditures incurred for events that will occur at a future time"]
[5702,"ADVERTISING – Newspaper, radio or TV ads for a program or University related event"]
[5204,"ALUMNI BENEFITS – For TU Alumni Association Use ONLY - MVA LICENCE PLATES, BRICKS, ETC."]
[5260,"AWARDS – plaques, trophies, faculty/staff awards (not a scholarship award)"]
[5404,"BOOKS / PRINTED MATERIALS / SUBSCRIPTIONS – Purchases of books, magazines, subscriptions, periodicals, etc."]
[5950,"BUILDING REPAIRS & MAINTENANCE – Repairs and maintenance to TU buildings"]
[5300,"CATERING – Payments to vendors who provide food and drink at TU events (Chartwells, Ocean Pride, Classic Catering, etc.)  MUST provide a list of attendees"]
[5654,"CONFERENCES & SEMINARS – Registration fees and/or conference materials for attending both in and out of state conferences and seminars (DO NOT include travel expenses - USE Code 5752)"]
[5256,"CONSULTING & OTHER CONTRACTUAL SERVICES – Payments to an individual or company for a specific or specialized project - someone paid for their expert professional advice"]
[6206,"COST OF GOODS FOR RESALE – Merchandise purchased for resale (T-shirts, CD’s, etc.)"]
[5508,"CREDIT CARD FEES – Self Explanatory"]
[6000,"DUES & MEMBERSHIPS – Payments to outside organizations for annual dues and memberships (Center Club, golf memberships, CPA dues, etc.)"]
[5554,"EDUCATIONAL PROGRAMS – A workshop, field trips, educational workshops, seminars"]
{"$rows_left_out":32}
{"sheet":"JE - TUF USE ONLY","index":4,"n_rows":32,"n_cols":23,"rows_kept":32,"cut":false,"hidden":false,"merged":[]}
[{"$f":"+N1","v":{"$error":"#VALUE!"}},{"$f":"+'CC Expense Form Pg 1'!D14","v":""},{"$f":"+'CC Expense Form Pg 1'!E14","v":""},{"$f":"+'CC Expense Form Pg 1'!F14","v":0},{"$f":"+T1","v":"Corp Credit Card Transactions"},{"$f":"+S1","v":"0 - "},{"$f":"IF(W1<3000,\"\",'CC Expense Form Pg 1'!I14)","v":{"$error":"#VALUE!"}},null,null,{"$f":"MID('CC Expense Form Pg 1'!B14,1,4)","v":""},{"$f":"IF(W1<4999,\"01-\",IF('CC Expense Form Pg 1'!K14=\"\",\"\",IF(G1<10000,\"01-\",IF(G1>9999,\"02-\",\"\"))))","v":{"$error":"#VALUE!"}},{"$f":"+J1","v":""},{"$f":"IF(W1<4999,\"-0\",IF('CC Expense Form Pg 1'!I14=3450,\"-2\",IF('CC Expense Form Pg 1'!K14=\"Yes\",\"-3\",IF('CC Expense Form Pg 1'!K14=\"No\",\"-1\",\"\"))))","v":{"$error":"#VALUE!"}},{"$f":"CONCATENATE(K1,L1,M1)","v":{"$error":"#VALUE!"}},{"$f":"IF('CC Expense Form Pg 1'!H14=\"\",\"\",'CC Expense Form Pg 1'!H14)","v":""},{"$f":"+'CC Expense Form Pg 1'!F8","v":0}," - ",{"$f":"CONCATENATE(P1,Q1,O1)","v":"0 - "},{"$f":"MID(R1,1,100)","v":"0 - "},"Corp Credit Card Transactions",null,{"$f":"-J1","v":{"$error":"#VALUE!"}},{"$f":"-V1","v":{"$error":"#VALUE!"}}]
[{"$f":"+N2","v":{"$error":"#VALUE!"}},{"$f":"+'CC Expense Form Pg 1'!D15","v":""},{"$f":"+'CC Expense Form Pg 1'!E15","v":""},{"$f":"+'CC Expense Form Pg 1'!F15","v":0},"Corp Credit Card Transactions",{"$f":"+S2","v":"0 - "},{"$f":"IF(W2<3000,\"\",'CC Expense Form Pg 1'!I15)","v":{"$error":"#VALUE!"}},null,null,{"$f":"MID('CC Expense Form Pg 1'!B15,1,4)","v":""},{"$f":"IF(W2<4999,\"01-\",IF('CC Expense Form Pg 1'!K15=\"\",\"\",IF(G2<10000,\"01-\",IF(G2>9999,\"02-\",\"\"))))","v":{"$error":"#VALUE!"}},"",{"$f":"IF(W2<4999,\"-0\",IF('CC Expense Form Pg 1'!I15=3450,\"-2\",IF('CC Expense Form Pg 1'!K15=\"Yes\",\"-3\",IF('CC Expense Form Pg 1'!K15=\"No\",\"-1\",\"\"))))","v":{"$error":"#VALUE!"}},{"$f":"CONCATENATE(K2,L2,M2)","v":{"$error":"#VALUE!"}},{"$f":"IF('CC Expense Form Pg 1'!H15=\"\",\"\",'CC Expense Form Pg 1'!H15)","v":""},{"$f":"+P1","v":0}," - ",{"$f":"CONCATENATE(P2,Q2,O2)","v":"0 - "},{"$f":"MID(R2,1,100)","v":"0 - "},"Corp Credit Card Transactions",null,{"$error":"#VALUE!"},{"$f":"-V2","v":{"$error":"#VALUE!"}}]
[{"$error":"#VALUE!"},{"$f":"+'CC Expense Form Pg 1'!D16","v":""},{"$f":"+'CC Expense Form Pg 1'!E16","v":""},{"$f":"+'CC Expense Form Pg 1'!F16","v":0},"Corp Credit Card Transactions","0 - ",{"$f":"IF(W3<3000,\"\",'CC Expense Form Pg 1'!I16)","v":{"$error":"#VALUE!"}},null,null,{"$f":"MID('CC Expense Form Pg 1'!B16,1,4)","v":""},{"$f":"IF(W3<4999,\"01-\",IF('CC Expense Form Pg 1'!K16=\"\",\"\",IF(G3<10000,\"01-\",IF(G3>9999,\"02-\",\"\"))))","v":{"$error":"#VALUE!"}},"",{"$f":"IF(W3<4999,\"-0\",IF('CC Expense Form Pg 1'!I16=3450,\"-2\",IF('CC Expense Form Pg 1'!K16=\"Yes\",\"-3\",IF('CC Expense Form Pg 1'!K16=\"No\",\"-1\",\"\"))))","v":{"$error":"#VALUE!"}},{"$error":"#VALUE!"},{"$f":"IF('CC Expense Form Pg 1'!H16=\"\",\"\",'CC Expense Form Pg 1'!H16)","v":""},{"$f":"+P2","v":0}," - ","0 - ","0 - ","Corp Credit Card Transactions",null,{"$error":"#VALUE!"},{"$error":"#VALUE!"}]
[{"$error":"#VALUE!"},{"$f":"+'CC Expense Form Pg 1'!D17","v":""},{"$f":"+'CC Expense Form Pg 1'!E17","v":""},{"$f":"+'CC Expense Form Pg 1'!F17","v":0},"Corp Credit Card Transactions","0 - ",{"$f":"IF(W4<3000,\"\",'CC Expense Form Pg 1'!I17)","v":{"$error":"#VALUE!"}},null,null,{"$f":"MID('CC Expense Form Pg 1'!B17,1,4)","v":""},{"$f":"IF(W4<4999,\"01-\",IF('CC Expense Form Pg 1'!K17=\"\",\"\",IF(G4<10000,\"01-\",IF(G4>9999,\"02-\",\"\"))))","v":{"$error":"#VALUE!"}},"",{"$f":"IF(W4<4999,\"-0\",IF('CC Expense Form Pg 1'!I17=3450,\"-2\",IF('CC Expense Form Pg 1'!K17=\"Yes\",\"-3\",IF('CC Expense Form Pg 1'!K17=\"No\",\"-1\",\"\"))))","v":{"$error":"#VALUE!"}},{"$error":"#VALUE!"},{"$f":"IF('CC Expense Form Pg 1'!H17=\"\",\"\",'CC Expense Form Pg 1'!H17)","v":""},{"$f":"+P3","v":0}," - ","0 - ","0 - ","Corp Credit Card Transactions",null,{"$error":"#VALUE!"},{"$error":"#VALUE!"}]
[{"$error":"#VALUE!"},{"$f":"+'CC Expense Form Pg 1'!D18","v":""},{"$f":"+'CC Expense Form Pg 1'!E18","v":""},{"$f":"+'CC Expense Form Pg 1'!F18","v":0},"Corp Credit Card Transactions","0 - ",{"$f":"IF(W5<3000,\"\",'CC Expense Form Pg 1'!I18)","v":{"$error":"#VALUE!"}},null,null,{"$f":"MID('CC Expense Form Pg 1'!B18,1,4)","v":""},{"$f":"IF(W5<4999,\"01-\",IF('CC Expense Form Pg 1'!K18=\"\",\"\",IF(G5<10000,\"01-\",IF(G5>9999,\"02-\",\"\"))))","v":{"$error":"#VALUE!"}},{"$f":"+J5","v":""},{"$f":"IF(W5<4999,\"-0\",IF('CC Expense Form Pg 1'!I18=3450,\"-2\",IF('CC Expense Form Pg 1'!K18=\"Yes\",\"-3\",IF('CC Expense Form Pg 1'!K18=\"No\",\"-1\",\"\"))))","v":{"$error":"#VALUE!"}},{"$error":"#VALUE!"},{"$f":"IF('CC Expense Form Pg 1'!H18=\"\",\"\",'CC Expense Form Pg 1'!H18)","v":""},{"$f":"+P4","v":0}," - ","0 - ","0 - ","Corp Credit Card Transactions",null,{"$error":"#VALUE!"},{"$error":"#VALUE!"}]
[{"$error":"#VALUE!"},{"$f":"+'CC Expense Form Pg 1'!D19","v":""},{"$f":"+'CC Expense Form Pg 1'!E19","v":""},{"$f":"+'CC Expense Form Pg 1'!F19","v":0},"Corp Credit Card Transactions","0 - ",{"$f":"IF(W6<3000,\"\",'CC Expense Form Pg 1'!I19)","v":{"$error":"#VALUE!"}},null,null,{"$f":"MID('CC Expense Form Pg 1'!B19,1,4)","v":""},{"$f":"IF(W6<4999,\"01-\",IF('CC Expense Form Pg 1'!K19=\"\",\"\",IF(G6<10000,\"01-\",IF(G6>9999,\"02-\",\"\"))))","v":{"$error":"#VALUE!"}},"",{"$f":"IF(W6<4999,\"-0\",IF('CC Expense Form Pg 1'!I19=3450,\"-2\",IF('CC Expense Form Pg 1'!K19=\"Yes\",\"-3\",IF('CC Expense Form Pg 1'!K19=\"No\",\"-1\",\"\"))))","v":{"$error":"#VALUE!"}},{"$error":"#VALUE!"},{"$f":"IF('CC Expense Form Pg 1'!H19=\"\",\"\",'CC Expense Form Pg 1'!H19)","v":""},0," - ","0 - ","0 - ","Corp Credit Card Transactions",null,{"$error":"#VALUE!"},{"$error":"#VALUE!"}]
[{"$error":"#VALUE!"},{"$f":"+'CC Expense Form Pg 1'!D20","v":""},{"$f":"+'CC Expense Form Pg 1'!E20","v":""},{"$f":"+'CC Expense Form Pg 1'!F20","v":0},"Corp Credit Card Transactions","0 - ",{"$f":"IF(W7<3000,\"\",'CC Expense Form Pg 1'!I20)","v":{"$error":"#VALUE!"}},null,null,{"$f":"MID('CC Expense Form Pg 1'!B20,1,4)","v":""},{"$f":"IF(W7<4999,\"01-\",IF('CC Expense Form Pg 1'!K20=\"\",\"\",IF(G7<10000,\"01-\",IF(G7>9999,\"02-\",\"\"))))","v":{"$error":"#VALUE!"}},"",{"$f":"IF(W7<4999,\"-0\",IF('CC Expense Form Pg 1'!I20=3450,\"-2\",IF('CC Expense Form Pg 1'!K20=\"Yes\",\"-3\",IF('CC Expense Form Pg 1'!K20=\"No\",\"-1\",\"\"))))","v":{"$error":"#VALUE!"}},{"$error":"#VALUE!"},{"$f":"IF('CC Expense Form Pg 1'!H20=\"\",\"\",'CC Expense Form Pg 1'!H20)","v":""},0," - ","0 - ","0 - ","Corp Credit Card Transactions",null,{"$error":"#VALUE!"},{"$error":"#VALUE!"}]
[{"$error":"#VALUE!"},{"$f":"+'CC Expense Form Pg 1'!D21","v":""},{"$f":"+'CC Expense Form Pg 1'!E21","v":""},{"$f":"+'CC Expense Form Pg 1'!F21","v":0},"Corp Credit Card Transactions","0 - ",{"$f":"IF(W8<3000,\"\",'CC Expense Form Pg 1'!I21)","v":{"$error":"#VALUE!"}},null,null,{"$f":"MID('CC Expense Form Pg 1'!B21,1,4)","v":""},{"$f":"IF(W8<4999,\"01-\",IF('CC Expense Form Pg 1'!K21=\"\",\"\",IF(G8<10000,\"01-\",IF(G8>9999,\"02-\",\"\"))))","v":{"$error":"#VALUE!"}},"",{"$f":"IF(W8<4999,\"-0\",IF('CC Expense Form Pg 1'!I21=3450,\"-2\",IF('CC Expense Form Pg 1'!K21=\"Yes\",\"-3\",IF('CC Expense Form Pg 1'!K21=\"No\",\"-1\",\"\"))))","v":{"$error":"#VALUE!"}},{"$error":"#VALUE!"},{"$f":"IF('CC Expense Form Pg 1'!H21=\"\",\"\",'CC Expense Form Pg 1'!H21)","v":""},0," - ","0 - ","0 - ","Corp Credit Card Transactions",null,{"$error":"#VALUE!"},{"$error":"#VALUE!"}]
[{"$error":"#VALUE!"},{"$f":"+'CC Expense Form Pg 1'!D22","v":""},{"$f":"+'CC Expense Form Pg 1'!E22","v":""},{"$f":"+'CC Expense Form Pg 1'!F22","v":0},"Corp Credit Card Transactions","0 - ",{"$f":"IF(W9<3000,\"\",'CC Expense Form Pg 1'!I22)","v":{"$error":"#VALUE!"}},null,null,{"$f":"MID('CC Expense Form Pg 1'!B22,1,4)","v":""},{"$f":"IF(W9<4999,\"01-\",IF('CC Expense Form Pg 1'!K22=\"\",\"\",IF(G9<10000,\"01-\",IF(G9>9999,\"02-\",\"\"))))","v":{"$error":"#VALUE!"}},"",{"$f":"IF(W9<4999,\"-0\",IF('CC Expense Form Pg 1'!I22=3450,\"-2\",IF('CC Expense Form Pg 1'!K22=\"Yes\",\"-3\",IF('CC Expense Form Pg 1'!K22=\"No\",\"-1\",\"\"))))","v":{"$error":"#VALUE!"}},{"$error":"#VALUE!"},{"$f":"IF('CC Expense Form Pg 1'!H22=\"\",\"\",'CC Expense Form Pg 1'!H22)","v":""},0," - ","0 - ","0 - ","Corp Credit Card Transactions",null,{"$error":"#VALUE!"},{"$error":"#VALUE!"}]
[{"$error":"#VALUE!"},{"$f":"+'CC Expense Form Pg 1'!D23","v":""},{"$f":"+'CC Expense Form Pg 1'!E23","v":""},{"$f":"+'CC Expense Form Pg 1'!F23","v":0},"Corp Credit Card Transactions","0 - ",{"$f":"IF(W10<3000,\"\",'CC Expense Form Pg 1'!I23)","v":{"$error":"#VALUE!"}},null,null,{"$f":"MID('CC Expense Form Pg 1'!B23,1,4)","v":""},{"$f":"IF(W10<4999,\"01-\",IF('CC Expense Form Pg 1'!K23=\"\",\"\",IF(G10<10000,\"01-\",IF(G10>9999,\"02-\",\"\"))))","v":{"$error":"#VALUE!"}},"",{"$f":"IF(W10<4999,\"-0\",IF('CC Expense Form Pg 1'!I23=3450,\"-2\",IF('CC Expense Form Pg 1'!K23=\"Yes\",\"-3\",IF('CC Expense Form Pg 1'!K23=\"No\",\"-1\",\"\"))))","v":{"$error":"#VALUE!"}},{"$error":"#VALUE!"},{"$f":"IF('CC Expense Form Pg 1'!H23=\"\",\"\",'CC Expense Form Pg 1'!H23)","v":""},0," - ","0 - ","0 - ","Corp Credit Card Transactions",null,{"$error":"#VALUE!"},{"$error":"#VALUE!"}]
[{"$f":"+N11","v":{"$error":"#VALUE!"}},{"$f":"+'CC Expense Form Pg 2'!D14","v":""},{"$f":"+'CC Expense Form Pg 2'!E14","v":""},{"$f":"+'CC Expense Form Pg 2'!F14","v":0},{"$f":"+T11","v":"Corp Credit Card Transactions"},"0 - ",{"$f":"IF(W11<3000,\"\",'CC Expense Form Pg 2'!I14)","v":{"$error":"#VALUE!"}},null,null,{"$f":"MID('CC Expense Form Pg 2'!B14,1,4)","v":""},{"$f":"IF(W11<4999,\"01-\",IF('CC Expense Form Pg 2'!K14=\"\",\"\",IF(G11<10000,\"01-\",IF(G11>9999,\"02-\",\"\"))))","v":{"$error":"#VALUE!"}},"",{"$f":"IF(W11<4999,\"-0\",IF('CC Expense Form Pg 2'!I14=3450,\"-2\",IF('CC Expense Form Pg 2'!K14=\"Yes\",\"-3\",IF('CC Expense Form Pg 2'!K14=\"No\",\"-1\",\"\"))))","v":{"$error":"#VALUE!"}},{"$error":"#VALUE!"},{"$f":"IF('CC Expense Form Pg 2'!H14=\"\",\"\",'CC Expense Form Pg 2'!H14)","v":""},0," - ",{"$f":"CONCATENATE(P11,Q11,O11)","v":"0 - "},"0 - ","Corp Credit Card Transactions",null,{"$error":"#VALUE!"},{"$f":"-V11","v":{"$error":"#VALUE!"}}]
[{"$error":"#VALUE!"},{"$f":"+'CC Expense Form Pg 2'!D15","v":""},{"$f":"+'CC Expense Form Pg 2'!E15","v":""},{"$f":"+'CC Expense Form Pg 2'!F15","v":0},"Corp Credit Card Transactions","0 - ",{"$f":"IF(W12<3000,\"\",'CC Expense Form Pg 2'!I15)","v":{"$error":"#VALUE!"}},null,null,{"$f":"MID('CC Expense Form Pg 2'!B15,1,4)","v":""},{"$f":"IF(W12<4999,\"01-\",IF('CC Expense Form Pg 2'!K15=\"\",\"\",IF(G12<10000,\"01-\",IF(G12>9999,\"02-\",\"\"))))","v":{"$error":"#VALUE!"}},"",{"$f":"IF(W12<4999,\"-0\",IF('CC Expense Form Pg 2'!I15=3450,\"-2\",IF('CC Expense Form Pg 2'!K15=\"Yes\",\"-3\",IF('CC Expense Form Pg 2'!K15=\"No\",\"-1\",\"\"))))","v":{"$error":"#VALUE!"}},{"$error":"#VALUE!"},{"$f":"IF('CC Expense Form Pg 2'!H15=\"\",\"\",'CC Expense Form Pg 2'!H15)","v":""},0," - ","0 - ","0 - ","Corp Credit Card Transactions",null,{"$error":"#VALUE!"},{"$error":"#VALUE!"}]
[{"$error":"#VALUE!"},{"$f":"+'CC Expense Form Pg 2'!D16","v":""},{"$f":"+'CC Expense Form Pg 2'!E16","v":""},{"$f":"+'CC Expense Form Pg 2'!F16","v":0},"Corp Credit Card Transactions","0 - ",{"$f":"IF(W13<3000,\"\",'CC Expense Form Pg 2'!I16)","v":{"$error":"#VALUE!"}},null,null,{"$f":"MID('CC Expense Form Pg 2'!B16,1,4)","v":""},{"$f":"IF(W13<4999,\"01-\",IF('CC Expense Form Pg 2'!K16=\"\",\"\",IF(G13<10000,\"01-\",IF(G13>9999,\"02-\",\"\"))))","v":{"$error":"#VALUE!"}},"",{"$f":"IF(W13<4999,\"-0\",IF('CC Expense Form Pg 2'!I16=3450,\"-2\",IF('CC Expense Form Pg 2'!K16=\"Yes\",\"-3\",IF('CC Expense Form Pg 2'!K16=\"No\",\"-1\",\"\"))))","v":{"$error":"#VALUE!"}},{"$error":"#VALUE!"},{"$f":"IF('CC Expense Form Pg 2'!H16=\"\",\"\",'CC Expense Form Pg 2'!H16)","v":""},0," - ","0 - ","0 - ","Corp Credit Card Transactions",null,{"$error":"#VALUE!"},{"$error":"#VALUE!"}]
[{"$error":"#VALUE!"},{"$f":"+'CC Expense Form Pg 2'!D17","v":""},{"$f":"+'CC Expense Form Pg 2'!E17","v":""},{"$f":"+'CC Expense Form Pg 2'!F17","v":0},"Corp Credit Card Transactions","0 - ",{"$f":"IF(W14<3000,\"\",'CC Expense Form Pg 2'!I17)","v":{"$error":"#VALUE!"}},null,null,{"$f":"MID('CC Expense Form Pg 2'!B17,1,4)","v":""},{"$f":"IF(W14<4999,\"01-\",IF('CC Expense Form Pg 2'!K17=\"\",\"\",IF(G14<10000,\"01-\",IF(G14>9999,\"02-\",\"\"))))","v":{"$error":"#VALUE!"}},"",{"$f":"IF(W14<4999,\"-0\",IF('CC Expense Form Pg 2'!I17=3450,\"-2\",IF('CC Expense Form Pg 2'!K17=\"Yes\",\"-3\",IF('CC Expense Form Pg 2'!K17=\"No\",\"-1\",\"\"))))","v":{"$error":"#VALUE!"}},{"$error":"#VALUE!"},{"$f":"IF('CC Expense Form Pg 2'!H17=\"\",\"\",'CC Expense Form Pg 2'!H17)","v":""},0," - ","0 - ","0 - ","Corp Credit Card Transactions",null,{"$error":"#VALUE!"},{"$error":"#VALUE!"}]
[{"$error":"#VALUE!"},{"$f":"+'CC Expense Form Pg 2'!D18","v":""},{"$f":"+'CC Expense Form Pg 2'!E18","v":""},{"$f":"+'CC Expense Form Pg 2'!F18","v":0},"Corp Credit Card Transactions","0 - ",{"$f":"IF(W15<3000,\"\",'CC Expense Form Pg 2'!I18)","v":{"$error":"#VALUE!"}},null,null,{"$f":"MID('CC Expense Form Pg 2'!B18,1,4)","v":""},{"$f":"IF(W15<4999,\"01-\",IF('CC Expense Form Pg 2'!K18=\"\",\"\",IF(G15<10000,\"01-\",IF(G15>9999,\"02-\",\"\"))))","v":{"$error":"#VALUE!"}},"",{"$f":"IF(W15<4999,\"-0\",IF('CC Expense Form Pg 2'!I18=3450,\"-2\",IF('CC Expense Form Pg 2'!K18=\"Yes\",\"-3\",IF('CC Expense Form Pg 2'!K18=\"No\",\"-1\",\"\"))))","v":{"$error":"#VALUE!"}},{"$error":"#VALUE!"},{"$f":"IF('CC Expense Form Pg 2'!H18=\"\",\"\",'CC Expense Form Pg 2'!H18)","v":""},0," - ","0 - ","0 - ","Corp Credit Card Transactions",null,{"$error":"#VALUE!"},{"$error":"#VALUE!"}]
{"$rows_left_out":18}
{"sheet":"TABLES - TUF USE ONLY","index":5,"n_rows":116,"n_cols":4,"rows_kept":116,"cut":false,"hidden":false,"merged":[]}
["Yes"]
["No"]
[]
[]
[]
[]
[]
[]
[]
[]
[]
[]
[]
[]
[]
{"$rows_left_out":101}